Homepage Wiki Forum Buy

GNUBLIN embedded GNU/Linux

Open source learning and training plattorm for embedded GNU / Linux
A projects from Hochschule Augsburg and embedded projects GmbH

Project homepage: http://www.gnublin.org
Wiki: http://wiki.gnublin.org
Aktuelle Zeit: Mi 26. Sep 2018, 06:41

Alle Zeiten sind UTC + 1 Stunde [ Sommerzeit ]




Ein neues Thema erstellen Auf das Thema antworten  [ 3 Beiträge ] 
Autor Nachricht
BeitragVerfasst: Di 7. Apr 2015, 10:45 
Offline

Registriert: Di 7. Apr 2015, 10:23
Beiträge: 2
Hallo zusammen,
Ich versuche den 3er Kernel mit samt dem seriellen Treiber zu kompilieren und scheitere nun schon seit etlichen Tagen beim seriellen Modul. Ich bin mir ziemlich sicher, dass es ganz anfangs bereits ein Mal funktioniert hatte und ich es auch booten konnte, da aber statisch und nicht als Modul, was ich lieber wollte. Seitdem ich es von statisch auf Modul geändert habe bricht mein Kompilier-Vorgang folgendermaßen ab, auch, wenn ich es nun wieder auf statisch ändere. Hat jemand Ideen, woran das liegen könnte?:


Code:
  CC      drivers/tty/serial/sc16is7x2.o
drivers/tty/serial/sc16is7x2.c: In function 'sc16is7x2_handle_rx':
drivers/tty/serial/sc16is7x2.c:201:2: error: implicit declaration of function 'tty_insert_flip_string' [-Werror=implicit-function-declaration]
drivers/tty/serial/sc16is7x2.c: In function 'sc16is7x2_startup':
drivers/tty/serial/sc16is7x2.c:496:2: error: implicit declaration of function 'create_freezeable_workqueue' [-Werror=implicit-function-declaration]
drivers/tty/serial/sc16is7x2.c:496:18: warning: assignment makes pointer from integer without a cast [enabled by default]
drivers/tty/serial/sc16is7x2.c: In function 'sc16is7x2_register_gpio':
drivers/tty/serial/sc16is7x2.c:894:19: error: 'THIS_MODULE' undeclared (first use in this function)
drivers/tty/serial/sc16is7x2.c:894:19: note: each undeclared identifier is reported only once for each function it appears in
drivers/tty/serial/sc16is7x2.c: At top level:
drivers/tty/serial/sc16is7x2.c:1020:20: error: 'THIS_MODULE' undeclared here (not in a function)
drivers/tty/serial/sc16is7x2.c:1060:15: error: expected declaration specifiers or '...' before string constant
drivers/tty/serial/sc16is7x2.c:1061:16: error: expected declaration specifiers or '...' before string constant
drivers/tty/serial/sc16is7x2.c:1062:20: error: expected declaration specifiers or '...' before string constant
drivers/tty/serial/sc16is7x2.c:1063:14: error: expected declaration specifiers or '...' before string constant
cc1: some warnings being treated as errors
make[3]: *** [drivers/tty/serial/sc16is7x2.o] Error 1
make[2]: *** [drivers/tty/serial] Error 2
make[1]: *** [drivers/tty] Error 2
make: *** [drivers] Error 2


Nach oben
 Profil  
 
BeitragVerfasst: Fr 15. Jul 2016, 06:32 
Offline

Registriert: Di 23. Feb 2016, 07:58
Beiträge: 8
???
บาคาร่า โป๊กเกอร์ สล๊อต แทงบอล รวมไว้ที่นี่ที่เดียว เว็บไซด์เล่นคาสิโนออนไลน์ บาคาร่า


Nach oben
 Profil  
 
BeitragVerfasst: Sa 1. Jul 2017, 05:17 
Offline

Registriert: Sa 1. Jul 2017, 05:11
Beiträge: 10
Hallo zusammen, Ich versuche den 3er Kernel mit samt dem seriellen Treiber zu kompilieren und scheitere nun schon seit etlichen Tagen beim seriellen Modul.
8-) 8-) 8-) 8-) 8-)
GCLUB มือถือ
สูตรบาคาร่า


Nach oben
 Profil  
 
Beiträge der letzten Zeit anzeigen:  Sortiere nach  
Ein neues Thema erstellen Auf das Thema antworten  [ 3 Beiträge ] 

Alle Zeiten sind UTC + 1 Stunde [ Sommerzeit ]


Du darfst keine neuen Themen in diesem Forum erstellen.
Du darfst keine Antworten zu Themen in diesem Forum erstellen.
Du darfst deine Beiträge in diesem Forum nicht ändern.
Du darfst deine Beiträge in diesem Forum nicht löschen.
Du darfst keine Dateianhänge in diesem Forum erstellen.

Suche nach:
cron
Powered by phpBB® Forum Software © phpBB Group
Deutsche Übersetzung durch phpBB.de